Slide 1
Excellent Education Program
Innovative Methods of Teaching

Lorem ipsum dolor sit amet, consectetuer adipiscing elit. Cum sociis natoque penatibus et magnis dis parturient.

Slide 2
Learning Through Play
Devoted to the Early Education

Donec quam felis, ultricies nec, pellentesque eu, pretium quis, sem. Nulla consequat massa quis enim.

Slide 2
Learning Through Play
Devoted to the Early Education

Donec quam felis, ultricies nec, pellentesque eu, pretium quis, sem. Nulla consequat massa quis enim.

Slide 2
Learning Through Play
Devoted to the Early Education

Donec quam felis, ultricies nec, pellentesque eu, pretium quis, sem. Nulla consequat massa quis enim.

Slide 2
Learning Through Play
Devoted to the Early Education

Donec quam felis, ultricies nec, pellentesque eu, pretium quis, sem. Nulla consequat massa quis enim.

Slide 3
Learning Through Play
Find a Class for your Children

Aenean leo ligula, porttitor eu, consequat vitae, eleifend ac, enim. Aliquam lorem ante, dapibus in, viverra quis.

previous arrow
next arrow

Nexus – Deployment failed: repository element was not specified in the

Spread the Knowledge

scmuser created the topic: Nexus – Deployment failed: repository element was not specified in the

I am facing following error…
[code language=”css”]
Downloaded: repo.maven.apache.org/maven2/org/codehau…exus-utils-1.5.6.jar (245 KB a
t 573.0 KB/sec)
[INFO]
[INFO] BUILD FAILURE
[INFO]
[INFO] Total time: 9.923 s
[INFO] Finished at: 2015-09-05T16:32:03+05:30
[INFO] Final Memory: 21M/205M
[INFO]
[ERROR] Failed to execute goal org.apache.maven.plugins:maven-deploy-plugin:2.7:deploy (default-deploy) on project my-ma
ven: Deployment failed: repository element was not specified in the POM inside distributionManagement element or in -Dal
tDeploymentRepository=id::layout::url parameter -> [Help 1]
[ERROR]
[ERROR] To see the full stack trace of the errors, re-run Maven with the -e switch.
[ERROR] Re-run Maven using the -X switch to enable full debug logging.
[ERROR]
[ERROR] For more information about the errors and possible solutions, please read the following articles:
[ERROR] [Help 1] cwiki.apache.org/confluence/display/MAVE…joExecutionException
[/code]

Rajesh Kumar
Latest posts by Rajesh Kumar (see all)