Nexus – Failed to deploy artifacts: Could not transfer artifact

By | December 9, 2017

scmuser created the topic: Nexus – Failed to deploy artifacts: Could not transfer artifact

[INFO]
[INFO] BUILD FAILURE
[INFO]
[INFO] Total time: 6.457 s
[INFO] Finished at: 2015-09-05T16:44:40+05:30
[INFO] Final Memory: 11M/165M
[INFO]
[ERROR] Failed to execute goal org.apache.maven.plugins:maven-deploy-plugin:2.7:deploy (default-deploy) on project my-maven: Failed to deploy artifacts: Could not transfer artifact com.scmgalaxy.mavensample:my-maven:jar:3.0 from/to deployment ( uvo193bnk02rz2cuv74.vm.cld.sr:8081/nexus...positories/releases/ ): Failed to transfer file: uvo193bnk02rz2cuv74.vm.cld.sr:8081/nexus...3.0/my-maven-3.0.jar . Return code is: 401, ReasonPhrase: Unauthorized. -> [Help 1]
[ERROR]
[ERROR] To see the full stack trace of the errors, re-run Maven with the -e switch.
[ERROR] Re-run Maven using the -X switch to enable full debug logging.
[ERROR]
[ERROR] For more information about the errors and possible solutions, please read the following articles:
[ERROR] [Help 1] cwiki.apache.org/confluence/display/MAVE...joExecutionException

Leave a Reply